Reaction Details
TargetProtein-glutamine gamma-glutamyltransferase 2
LigandBDBM50420477
Substrate/Competitorn/a
Meas. Tech.ChEMBL_841030 (CHEMBL2091156)
IC50 450±n/a nM
Citation Prime, MEAndersen, OABarker, JJBrooks, MACheng, RKToogood-Johnson, ICourtney, SMBrookfield, FAYarnold, CJMarston, RWJohnson, PDJohnsen, SFPalfrey, JJVaidya, DErfan, SIchihara, OFelicetti, BPalan, SPedret-Dunn, ASchaertl, SSternberger, IEbneth, AScheel, AWinkler, DToledo-Sherman, LBeconi, MMacdonald, DMuñoz-Sanjuan, IDominguez, CWityak, J Discovery and structure-activity relationship of potent and selective covalent inhibitors of transglutaminase 2 for Huntington's disease. J Med Chem55:1021-46 (2012) 
 
Protein-glutamine gamma-glutamyltransferase 2
Name:Protein-glutamine gamma-glutamyltransferase 2
Type:Protein
Mol. Mass.:77309.30
Organism:Homo sapiens (Human)
Description:P21980
Residue:687
BDBM50420477
NameBDBM50420477
Synonyms:CHEMBL2089399
TypeSmall organic molecule
Emp. Form.C22H25N3O5S
Mol. Mass.443.516
SMILESC=CC(=O)Nc1ccc(cc1)S(=O)(=O)NC1CCN(CC1)C(=O)OCc1ccccc1