Reaction Details
TargetProtein-glutamine gamma-glutamyltransferase E
LigandBDBM50420510
Substrate/Competitorn/a
Meas. Tech.ChEMBL_841033 (CHEMBL2091159)
IC50>80000±n/a nM
Citation Prime, MEAndersen, OABarker, JJBrooks, MACheng, RKToogood-Johnson, ICourtney, SMBrookfield, FAYarnold, CJMarston, RWJohnson, PDJohnsen, SFPalfrey, JJVaidya, DErfan, SIchihara, OFelicetti, BPalan, SPedret-Dunn, ASchaertl, SSternberger, IEbneth, AScheel, AWinkler, DToledo-Sherman, LBeconi, MMacdonald, DMuñoz-Sanjuan, IDominguez, CWityak, J Discovery and structure-activity relationship of potent and selective covalent inhibitors of transglutaminase 2 for Huntington's disease. J Med Chem55:1021-46 (2012) 
 
Protein-glutamine gamma-glutamyltransferase E
Name:Protein-glutamine gamma-glutamyltransferase E
Type:Protein
Mol. Mass.:76625.90
Organism:Homo sapiens (Human)
Description:n/a
Residue:693
BDBM50420510
NameBDBM50420510
Synonyms:CHEMBL2086515
TypeSmall organic molecule
Emp. Form.C27H27N3O6S
Mol. Mass.521.585
SMILESC=CC(=O)Nc1ccc(cc1)S(=O)(=O)N1CCN(CC1)C(=O)OCc1cccc(Oc2ccccc2)c1