Reaction Details
TargetCoagulation factor XIII A chain
LigandBDBM50420503
Substrate/Competitorn/a
Meas. Tech.ChEMBL_841034 (CHEMBL2091160)
IC50 39±n/a nM
Citation Prime, MEAndersen, OABarker, JJBrooks, MACheng, RKToogood-Johnson, ICourtney, SMBrookfield, FAYarnold, CJMarston, RWJohnson, PDJohnsen, SFPalfrey, JJVaidya, DErfan, SIchihara, OFelicetti, BPalan, SPedret-Dunn, ASchaertl, SSternberger, IEbneth, AScheel, AWinkler, DToledo-Sherman, LBeconi, MMacdonald, DMuñoz-Sanjuan, IDominguez, CWityak, J Discovery and structure-activity relationship of potent and selective covalent inhibitors of transglutaminase 2 for Huntington's disease. J Med Chem55:1021-46 (2012) 
 
Coagulation factor XIII A chain
Name:Coagulation factor XIII A chain
Type:PROTEIN
Mol. Mass.:83261.29
Organism:Homo sapiens (Human)
Description:ChEMBL_1475048
Residue:732
BDBM50420503
NameBDBM50420503
Synonyms:CHEMBL2086505
TypeSmall organic molecule
Emp. Form.C22H22F3N3O5S
Mol. Mass.497.487
SMILESFC(F)(F)c1cc(NC(=O)C=C)ccc1S(=O)(=O)N1CCN(CC1)C(=O)OCc1ccccc1