Reaction Details
TargetProtein-glutamine gamma-glutamyltransferase K
LigandBDBM50420475
Substrate/Competitorn/a
Meas. Tech.ChEMBL_841032 (CHEMBL2091158)
IC50 2900±n/a nM
Citation Prime, MEAndersen, OABarker, JJBrooks, MACheng, RKToogood-Johnson, ICourtney, SMBrookfield, FAYarnold, CJMarston, RWJohnson, PDJohnsen, SFPalfrey, JJVaidya, DErfan, SIchihara, OFelicetti, BPalan, SPedret-Dunn, ASchaertl, SSternberger, IEbneth, AScheel, AWinkler, DToledo-Sherman, LBeconi, MMacdonald, DMuñoz-Sanjuan, IDominguez, CWityak, J Discovery and structure-activity relationship of potent and selective covalent inhibitors of transglutaminase 2 for Huntington's disease. J Med Chem55:1021-46 (2012) 
 
Protein-glutamine gamma-glutamyltransferase K
Name:Protein-glutamine gamma-glutamyltransferase K
Type:Protein
Mol. Mass.:89778.63
Organism:Homo sapiens (Human)
Description:n/a
Residue:817
BDBM50420475
NameBDBM50420475
Synonyms:CHEMBL2089396
TypeSmall organic molecule
Emp. Form.C23H27N3O5S
Mol. Mass.457.543
SMILESC=CC(=O)Nc1ccc(cc1)S(=O)(=O)N1CCC(CNC(=O)OCc2ccccc2)CC1