Reaction Details
TargetNeuronal acetylcholine receptor subunit alpha-7
LigandBDBM10759
Substrate/Competitorn/a
Meas. Tech.ChEMBL_842055 (CHEMBL2091472)
EC50 3120±n/a nM
Citation Zanaletti, RBettinetti, LCastaldo, CCocconcelli, GComery, TDunlop, JGaviraghi, GGhiron, CHaydar, SNJow, FMaccari, LMicco, INencini, AScali, CTurlizzi, EValacchi, M Discovery of a novel alpha-7 nicotinic acetylcholine receptor agonist series and characterization of the potent, selective, and orally efficacious agonist 5-(4-acetyl[1,4]diazepan-1-yl)pentanoic acid [5-(4-methoxyphenyl)-1H-pyrazol-3-yl] amide (SEN15924, WAY-361789). J Med Chem55:4806-23 (2012) 
 
Neuronal acetylcholine receptor subunit alpha-7
Name:Neuronal acetylcholine receptor subunit alpha-7
Type:Enzyme
Mol. Mass.:56502.44
Organism:Rattus norvegicus (Rat)
Description:Q05941
Residue:502
BDBM10759
NameBDBM10759
Synonyms:2-acetoxyethyl(trimethyl)ammonium;bromide CHEMBL667 [2-(acetyloxy)ethyl]trimethylazanium acetylcholine chloride | cid_6060
TypeSmall Organic Molecule
Emp. Form.C7H16NO2
Mol. Mass.146.2069
SMILESCC(=O)OCC[N+](C)(C)C