Reaction Details
TargetDipeptidyl peptidase 4
LigandBDBM11113
Substrate/Competitorn/a
Meas. Tech.ChEMBL_842192 (CHEMBL2091655)
IC50 7.2±n/a nM
Citation Jadav, PBahekar, RShah, SRPatel, DJoharapurkar, AKshirsagar, SJain, MShaikh, MSairam, KV Long-acting peptidomimetics based DPP-IV inhibitors. Bioorg Med Chem Lett22:3516-21 (2012) 
 
Dipeptidyl peptidase 4
Name:Dipeptidyl peptidase 4
Type:Enzyme
Mol. Mass.:88271.01
Organism:Homo sapiens (Human)
Description:P27487
Residue:766
BDBM11113
NameBDBM11113
Synonyms:6-{[2-({2-[(2S)-2-cyanopyrrolidin-1-yl]-2-oxoethyl}amino)ethyl]amino}pyridine-3-carbonitrile CHEMBL77538 cyano-(S)-pyrrolidine deriv. 1 | cyanopyrrolidine derivative 2
TypeSmall organic molecule
Emp. Form.C15H18N6O
Mol. Mass.298.343
SMILESO=C(CNCCNc1ccc(cn1)C#N)N1CCC[C@H]1C#N