Reaction Details
TargetCaspase-3
LigandBDBM10331
Substrate/Competitorn/a
Meas. Tech.ChEMBL_842368 (CHEMBL2091985)
IC50 12.02±n/a nM
Citation Hasegawa, KFunatsu, K New description of protein-ligand interactions using a spherical self-organizing map. Bioorg Med Chem20:5410-5 (2012) 
 
Caspase-3
Name:Caspase-3
Type:Hydrolase; heterotetramer of two heterodimers
Mol. Mass.:31607.55
Organism:Homo sapiens (Human)
Description:n/a
Residue:277
BDBM10331
NameBDBM10331
Synonyms:(S)-1-(4-Fluorobenzyl)-5-(2-phenoxymethyl-pyrrolidine-1-sulfonyl)-1H-indole-2,3-dione CHEMBL372607 | Pyrrolidine Isatin Analogue 11c
TypeSmall organic molecule
Emp. Form.C26H23FN2O5S
Mol. Mass.494.535
SMILESFc1ccc(CN2C(=O)C(=O)c3cc(ccc23)S(=O)(=O)N2CCC[C@H]2COc2ccccc2)cc1