Reaction Details
TargetDual specificity mitogen-activated protein kinase kinase 1
LigandBDBM50420692
Substrate/Competitorn/a
Meas. Tech.ChEMBL_842390 (CHEMBL2092007)
IC50 13±n/a nM
Citation Heald, RAJackson, PSavy, PJones, MGancia, EBurton, BNewman, RBoggs, JChan, EChan, JChoo, EMerchant, MRudewicz, PUltsch, MWiesmann, CYue, QBelvin, MPrice, S Discovery of novel allosteric mitogen-activated protein kinase kinase (MEK) 1,2 inhibitors possessing bidentate Ser212 interactions. J Med Chem55:4594-604 (2012) 
 
Dual specificity mitogen-activated protein kinase kinase 1
Name:Dual specificity mitogen-activated protein kinase kinase 1
Type:Other Protein Type
Mol. Mass.:43439.03
Organism:Homo sapiens (Human)
Description:Full-length human MEK-1 was generated by PCR and purified as a fusion protein from Escherichia coli lysates.
Residue:393
BDBM50420692
NameBDBM50420692
Synonyms:CHEMBL2087076
TypeSmall organic molecule
Emp. Form.C16H14FIN4O3
Mol. Mass.456.2102
SMILESOCCONC(=O)c1ccc2[nH]ncc2c1Nc1ccc(I)cc1F