Reaction Details
TargetPhosphatidylinositol 3-kinase regulatory subunit alpha/4,5-bisphosphate 3-kinase catalytic subunit alpha isoform
LigandBDBM50420736
Substrate/Competitorn/a
Meas. Tech.ChEMBL_842409 (CHEMBL2092082)
Ki 6.2±n/a nM
Citation Martínez González, SHernández, AIVarela, CRodríguez-Arístegui, SLorenzo, MRodríguez, ARivero, VMartín, JISaluste, CGRamos-Lima, FCendón, ECebrián, DAguirre, EGomez-Casero, EAlbarrán, MAlfonso, PGarcía-Serelde, BOyarzabal, JRabal, OMulero, FGonzalez-Granda, TLink, WFominaya, JBarbacid, MBischoff, JRPizcueta, PPastor, J Identification of ETP-46321, a potent and orally bioavailable PI3Ka,d inhibitor. Bioorg Med Chem Lett22:3460-6 (2012) 
 
Phosphatidylinositol 3-kinase regulatory subunit alpha/4,5-bisphosphate 3-kinase catalytic subunit alpha isoform
Name:Phosphatidylinositol 3-kinase regulatory subunit alpha/4,5-bisphosphate 3-kinase catalytic subunit alpha isoform
Type:Protein
Mol. Mass.:n/a
Description:n/a
Components:This complex has 2 components.
Component 1
Name:Phosphatidylinositol 4,5-bisphosphate 3-kinase catalytic subunit alpha isoform
Synonyms:P42336 PI3-kinase subunit p110-alpha PIK3CA Phosphatidylinositol 3-kinase alpha (PI3Kalpha) Phosphatidylinositol 4,5-bisphosphate 3-kinase (PI3K) Phosphatidylinositol 4,5-bisphosphate 3-kinase catalytic subunit alpha (PI3Kalpha) Phosphatidylinositol 4,5-bisphosphate 3-kinase catalytic subunit alpha isoform (PI3-Ka) Phosphatidylinositol 4,5-bisphosphate 3-kinase catalytic subunit alpha isoform (PI3K p110alpha) Phosphatidylinositol 4,5-bisphosphate 3-kinase catalytic subunit alpha isoform (PI3K-alpha) Phosphatidylinositol 4,5-bisphosphate 3-kinase catalytic subunit alpha isoform (PI3Kalpha p110alpha) Phosphatidylinositol 4,5-bisphosphate 3-kinase catalytic subunit alpha isoform (PIK3CA) Phosphatidylinositol-4,5-bisphosphate 3-kinase catalytic subunit alpha isoform Phosphoinositide 3-Kinase (PI3K), alpha Chain A Phosphoinositide 3-kinases (PI3K) PtdIns-3-kinase p110 | p110 alpha
Type:Enzyme Subunit
Mol. Mass.:124294.87
Organism:Homo sapiens (Human)
Description:P42336
Residue:1068
Component 2
Name:Phosphatidylinositol 3-kinase regulatory subunit alpha
Synonyms:GRB1 PI3-kinase class I PI3-kinase p85-alpha subunit PI3-kinase subunit p85-alpha PIK3CG/PIK3R1 Phosphatidylinositol 3-kinase 85 kDa regulatory subunit alpha (PI3K alpha) Phosphatidylinositol 3-kinase regulatory subunit alpha (PIK3R1) Phosphatidylinositol 3-kinase regulatory subunit alpha isoform 1 (PI3 Kinase alpha) Phosphatidylinositol 4,5-bisphosphate 3-kinase catalytic subunit alpha isoform (PI3Kalpha) PtdIns-3-kinase p85-alpha p85 alpha
Type:Protein
Mol. Mass.:83592.82
Organism:Homo sapiens (Human)
Description:P27986
Residue:724
BDBM50420736
NameBDBM50420736
Synonyms:CHEMBL2087483
TypeSmall organic molecule
Emp. Form.C21H29N9O3S
Mol. Mass.487.578
SMILESC[C@H]1CN(Cc2cn3cc(nc(N4CCOCC4)c3n2)-c2cnc(N)nc2)CCN1S(C)(=O)=O