Reaction Details
TargetMitogen-activated protein kinase 13
LigandBDBM50420752
Substrate/Competitorn/a
Meas. Tech.ChEMBL_842608 (CHEMBL2092446)
IC50 12±n/a nM
Citation Aiguadé, JBalagué, CCarranco, ICaturla, FDomínguez, MEastwood, PEsteve, CGonzález, JLumeras, WOrellana, APreciado, SRoca, RVidal, LVidal, B Novel triazolopyridylbenzamides as potent and selective p38a inhibitors. Bioorg Med Chem Lett22:3431-6 (2012) 
 
Mitogen-activated protein kinase 13
Name:Mitogen-activated protein kinase 13
Type:Enzyme
Mol. Mass.:42097.16
Organism:Homo sapiens (Human)
Description:O15264
Residue:365
BDBM50420752
NameBDBM50420752
Synonyms:CHEMBL2087746
TypeSmall organic molecule
Emp. Form.C20H20F3N5O
Mol. Mass.403.4009
SMILESCc1c(F)cc(cc1-c1c(F)cn2c(nnc2c1F)C(C)(C)N)C(=O)NC1CC1