Reaction Details
TargetMitogen-activated protein kinase 13
LigandBDBM50420757
Substrate/Competitorn/a
Meas. Tech.ChEMBL_842608 (CHEMBL2092446)
IC50 27±n/a nM
Citation Aiguadé, JBalagué, CCarranco, ICaturla, FDomínguez, MEastwood, PEsteve, CGonzález, JLumeras, WOrellana, APreciado, SRoca, RVidal, LVidal, B Novel triazolopyridylbenzamides as potent and selective p38a inhibitors. Bioorg Med Chem Lett22:3431-6 (2012) 
 
Mitogen-activated protein kinase 13
Name:Mitogen-activated protein kinase 13
Type:Enzyme
Mol. Mass.:42097.16
Organism:Homo sapiens (Human)
Description:O15264
Residue:365
BDBM50420757
NameBDBM50420757
Synonyms:CHEMBL2087502
TypeSmall organic molecule
Emp. Form.C20H22N4O
Mol. Mass.334.4149
SMILESCC(C)c1nnc2cc(ccn12)-c1cc(ccc1C)C(=O)NC1CC1