Reaction Details
TargetNociceptin receptor
LigandBDBM50420809
Substrate/Competitorn/a
Meas. Tech.ChEMBL_839689 (CHEMBL2090803)
Ki 2.05±n/a nM
Citation Pedregal, CJoshi, EMToledo, MALafuente, CDiaz, NMartinez-Grau, MAJiménez, ABenito, ANavarro, AChen, ZMudra, DRKahl, SDRash, KSStatnick, MABarth, VN Development of LC-MS/MS-based receptor occupancy tracers and positron emission tomography radioligands for the nociceptin/orphanin FQ (NOP) receptor. J Med Chem55:4955-67 (2012) 
 
Nociceptin receptor
Name:Nociceptin receptor
Type:G Protein-Coupled Receptor (GPCR)
Mol. Mass.:40702.87
Organism:Homo sapiens (Human)
Description:P41146
Residue:370
BDBM50420809
NameBDBM50420809
Synonyms:CHEMBL2088038 | CHEMBL2088039
TypeSmall organic molecule
Emp. Form.C20H28N4O2S
Mol. Mass.388.527
SMILESCN(C)C(=O)C(CN1CCC2(CC1)OCCc1ccsc21)Cn1cccn1