Reaction Details
TargetKappa-type opioid receptor
LigandBDBM50420809
Substrate/Competitorn/a
Meas. Tech.ChEMBL_839811 (CHEMBL2089822)
Ki>400±n/a nM
Citation Pedregal, CJoshi, EMToledo, MALafuente, CDiaz, NMartinez-Grau, MAJiménez, ABenito, ANavarro, AChen, ZMudra, DRKahl, SDRash, KSStatnick, MABarth, VN Development of LC-MS/MS-based receptor occupancy tracers and positron emission tomography radioligands for the nociceptin/orphanin FQ (NOP) receptor. J Med Chem55:4955-67 (2012) 
 
Kappa-type opioid receptor
Name:Kappa-type opioid receptor
Type:G Protein-Coupled Receptor (GPCR)
Mol. Mass.:42648.76
Organism:Homo sapiens (Human)
Description:P41145
Residue:380
BDBM50420809
NameBDBM50420809
Synonyms:CHEMBL2088038 | CHEMBL2088039
TypeSmall organic molecule
Emp. Form.C20H28N4O2S
Mol. Mass.388.527
SMILESCN(C)C(=O)C(CN1CCC2(CC1)OCCc1ccsc21)Cn1cccn1