Reaction Details
TargetNociceptin receptor
LigandBDBM50420802
Substrate/Competitorn/a
Meas. Tech.ChEMBL_839690 (CHEMBL2090804)
EC50 21±n/a nM
Citation Pedregal, CJoshi, EMToledo, MALafuente, CDiaz, NMartinez-Grau, MAJiménez, ABenito, ANavarro, AChen, ZMudra, DRKahl, SDRash, KSStatnick, MABarth, VN Development of LC-MS/MS-based receptor occupancy tracers and positron emission tomography radioligands for the nociceptin/orphanin FQ (NOP) receptor. J Med Chem55:4955-67 (2012) 
 
Nociceptin receptor
Name:Nociceptin receptor
Type:G Protein-Coupled Receptor (GPCR)
Mol. Mass.:40702.87
Organism:Homo sapiens (Human)
Description:P41146
Residue:370
BDBM50420802
NameBDBM50420802
Synonyms:CHEMBL2088034
TypeSmall organic molecule
Emp. Form.C26H31N3O
Mol. Mass.401.5438
SMILESO=C1NCN(c2ccccc2)C11CCN(CC1)[C@H]1CC[C@@H]2CCCc3cccc1c23