Reaction Details
TargetNociceptin receptor
LigandBDBM50400869
Substrate/Competitorn/a
Meas. Tech.ChEMBL_839690 (CHEMBL2090804)
Ki 4.5±n/a nM
Citation Pedregal, CJoshi, EMToledo, MALafuente, CDiaz, NMartinez-Grau, MAJiménez, ABenito, ANavarro, AChen, ZMudra, DRKahl, SDRash, KSStatnick, MABarth, VN Development of LC-MS/MS-based receptor occupancy tracers and positron emission tomography radioligands for the nociceptin/orphanin FQ (NOP) receptor. J Med Chem55:4955-67 (2012) 
 
Nociceptin receptor
Name:Nociceptin receptor
Type:G Protein-Coupled Receptor (GPCR)
Mol. Mass.:40702.87
Organism:Homo sapiens (Human)
Description:P41146
Residue:370
BDBM50400869
NameBDBM50400869
Synonyms:CHEMBL2088031
TypeSmall organic molecule
Emp. Form.C24H30F2N2O2S
Mol. Mass.448.569
SMILESCC(C)NC(=O)[C@@H](CN1CCC2(CC1)OCCc1cc(F)sc21)Cc1ccccc1F