Reaction Details
TargetNociceptin receptor
LigandBDBM50420822
Substrate/Competitorn/a
Meas. Tech.ChEMBL_839690 (CHEMBL2090804)
Ki>10±n/a nM
Citation Pedregal, CJoshi, EMToledo, MALafuente, CDiaz, NMartinez-Grau, MAJiménez, ABenito, ANavarro, AChen, ZMudra, DRKahl, SDRash, KSStatnick, MABarth, VN Development of LC-MS/MS-based receptor occupancy tracers and positron emission tomography radioligands for the nociceptin/orphanin FQ (NOP) receptor. J Med Chem55:4955-67 (2012) 
 
Nociceptin receptor
Name:Nociceptin receptor
Type:G Protein-Coupled Receptor (GPCR)
Mol. Mass.:40702.87
Organism:Homo sapiens (Human)
Description:P41146
Residue:370
BDBM50420822
NameBDBM50420822
Synonyms:CHEMBL2088046
TypeSmall organic molecule
Emp. Form.C24H32N2O3S
Mol. Mass.428.587
SMILESCOc1ccccc1CC(CN1CCC2(CC1)OCCc1ccsc21)C(=O)N(C)C