Reaction Details
TargetCannabinoid receptor 1
LigandBDBM50420889
Substrate/Competitorn/a
Meas. Tech.ChEMBL_840018 (CHEMBL2090508)
Ki>10000±n/a nM
Citation Pasquini, SMugnaini, CLigresti, ATafi, ABrogi, SFalciani, CPedani, VPesco, NGuida, FLuongo, LVarani, KBorea, PAMaione, SDi Marzo, VCorelli, F Design, synthesis, and pharmacological characterization of indol-3-ylacetamides, indol-3-yloxoacetamides, and indol-3-ylcarboxamides: potent and selective CB2 cannabinoid receptor inverse agonists. J Med Chem55:5391-402 (2012) 
 
Cannabinoid receptor 1
Name:Cannabinoid receptor 1
Type:G Protein-Coupled Receptor (GPCR)
Mol. Mass.:52868.96
Organism:Homo sapiens (Human)
Description:P21554
Residue:472
BDBM50420889
NameBDBM50420889
Synonyms:CHEMBL2087098
TypeSmall organic molecule
Emp. Form.C33H34N2O
Mol. Mass.474.6359
SMILESO=C(Cc1cn(Cc2ccccc2)c2ccc(cc12)-c1ccccc1)NC12CC3CC(CC(C3)C1)C2