Reaction Details
TargetCannabinoid receptor 2
LigandBDBM50420880
Substrate/Competitorn/a
Meas. Tech.ChEMBL_840019 (CHEMBL2090509)
Ki 377±n/a nM
Citation Pasquini, SMugnaini, CLigresti, ATafi, ABrogi, SFalciani, CPedani, VPesco, NGuida, FLuongo, LVarani, KBorea, PAMaione, SDi Marzo, VCorelli, F Design, synthesis, and pharmacological characterization of indol-3-ylacetamides, indol-3-yloxoacetamides, and indol-3-ylcarboxamides: potent and selective CB2 cannabinoid receptor inverse agonists. J Med Chem55:5391-402 (2012) 
 
Cannabinoid receptor 2
Name:Cannabinoid receptor 2
Type:G Protein-Coupled Receptor (GPCR)
Mol. Mass.:39690.94
Organism:Homo sapiens (Human)
Description:P34972
Residue:360
BDBM50420880
NameBDBM50420880
Synonyms:CHEMBL2087088
TypeSmall organic molecule
Emp. Form.C24H28N2O2
Mol. Mass.376.4913
SMILESC=CCn1cc(CC(=O)NC2CCCCCC2)c2cc(ccc12)-c1ccco1