Reaction Details
TargetCannabinoid receptor 2
LigandBDBM50420878
Substrate/Competitorn/a
Meas. Tech.ChEMBL_840019 (CHEMBL2090509)
Ki 11.8±n/a nM
Citation Pasquini, SMugnaini, CLigresti, ATafi, ABrogi, SFalciani, CPedani, VPesco, NGuida, FLuongo, LVarani, KBorea, PAMaione, SDi Marzo, VCorelli, F Design, synthesis, and pharmacological characterization of indol-3-ylacetamides, indol-3-yloxoacetamides, and indol-3-ylcarboxamides: potent and selective CB2 cannabinoid receptor inverse agonists. J Med Chem55:5391-402 (2012) 
 
Cannabinoid receptor 2
Name:Cannabinoid receptor 2
Type:G Protein-Coupled Receptor (GPCR)
Mol. Mass.:39690.94
Organism:Homo sapiens (Human)
Description:P34972
Residue:360
BDBM50420878
NameBDBM50420878
Synonyms:CHEMBL2087093
TypeSmall organic molecule
Emp. Form.C29H34N2O
Mol. Mass.426.5931
SMILESCCCn1cc(CC(=O)NC23CC4CC(CC(C4)C2)C3)c2cc(ccc12)-c1ccccc1