Reaction Details
TargetVascular endothelial growth factor receptor 2
LigandBDBM50420959
Substrate/Competitorn/a
Meas. Tech.ChEMBL_840548 (CHEMBL2090013)
IC50 25.12±n/a nM
Citation Norman, RASchott, AKAndrews, DMBreed, JFoote, KMGarner, APOgg, DOrme, JPPink, JHRoberts, KRudge, DAThomas, APLeach, AG Protein-ligand crystal structures can guide the design of selective inhibitors of the FGFR tyrosine kinase. J Med Chem55:5003-12 (2012) 
 
Vascular endothelial growth factor receptor 2
Name:Vascular endothelial growth factor receptor 2
Type:Receptor Tyrosine Kinase
Mol. Mass.:151510.97
Organism:Homo sapiens (Human)
Description:P35968
Residue:1356
BDBM50420959
NameBDBM50420959
Synonyms:CHEMBL2088095
TypeSmall organic molecule
Emp. Form.C20H20BrN7O
Mol. Mass.454.323
SMILESCc1cc(CNc2ncc(Br)c(Nc3cc(CCc4ccccc4)n[nH]3)n2)on1