Reaction Details
TargetFibroblast growth factor receptor 1
LigandBDBM50420960
Substrate/Competitorn/a
Meas. Tech.ChEMBL_840547 (CHEMBL2090012)
IC50 31.62±n/a nM
Citation Norman, RASchott, AKAndrews, DMBreed, JFoote, KMGarner, APOgg, DOrme, JPPink, JHRoberts, KRudge, DAThomas, APLeach, AG Protein-ligand crystal structures can guide the design of selective inhibitors of the FGFR tyrosine kinase. J Med Chem55:5003-12 (2012) 
 
Fibroblast growth factor receptor 1
Name:Fibroblast growth factor receptor 1
Type:Receptor
Mol. Mass.:91861.70
Organism:Homo sapiens (Human)
Description:P11362
Residue:822
BDBM50420960
NameBDBM50420960
Synonyms:CHEMBL2088092
TypeSmall organic molecule
Emp. Form.C16H20BrN7O
Mol. Mass.406.28
SMILESCc1cc(Nc2nc(NCc3cc(no3)C(C)(C)C)ncc2Br)[nH]n1