Reaction Details
TargetFibroblast growth factor receptor 1
LigandBDBM50420950
Substrate/Competitorn/a
Meas. Tech.ChEMBL_840547 (CHEMBL2090012)
IC50 25.12±n/a nM
Citation Norman, RASchott, AKAndrews, DMBreed, JFoote, KMGarner, APOgg, DOrme, JPPink, JHRoberts, KRudge, DAThomas, APLeach, AG Protein-ligand crystal structures can guide the design of selective inhibitors of the FGFR tyrosine kinase. J Med Chem55:5003-12 (2012) 
 
Fibroblast growth factor receptor 1
Name:Fibroblast growth factor receptor 1
Type:Receptor
Mol. Mass.:91861.70
Organism:Homo sapiens (Human)
Description:P11362
Residue:822
BDBM50420950
NameBDBM50420950
Synonyms:CHEMBL2088113
TypeSmall organic molecule
Emp. Form.C16H18BrN7
Mol. Mass.388.265
SMILESCCCc1cc(Nc2nc(NCc3cccnc3)ncc2Br)[nH]n1