Reaction Details
TargetVascular endothelial growth factor receptor 2
LigandBDBM50420961
Substrate/Competitorn/a
Meas. Tech.ChEMBL_840548 (CHEMBL2090013)
IC50 79.43±n/a nM
Citation Norman, RASchott, AKAndrews, DMBreed, JFoote, KMGarner, APOgg, DOrme, JPPink, JHRoberts, KRudge, DAThomas, APLeach, AG Protein-ligand crystal structures can guide the design of selective inhibitors of the FGFR tyrosine kinase. J Med Chem55:5003-12 (2012) 
 
Vascular endothelial growth factor receptor 2
Name:Vascular endothelial growth factor receptor 2
Type:Receptor Tyrosine Kinase
Mol. Mass.:151510.97
Organism:Homo sapiens (Human)
Description:P35968
Residue:1356
BDBM50420961
NameBDBM50420961
Synonyms:CHEMBL2088096
TypeSmall organic molecule
Emp. Form.C22H25N7O3
Mol. Mass.435.479
SMILESCOc1cc(CCc2cc(Nc3ccnc(NCc4cc(C)no4)n3)[nH]n2)cc(OC)c1