Reaction Details
TargetFibroblast growth factor receptor 1
LigandBDBM50421035
Substrate/Competitorn/a
Meas. Tech.ChEMBL_841301 (CHEMBL2090042)
IC50 8±n/a nM
Citation Kim, MHTsuhako, ALCo, EWAftab, DTBentzien, FChen, JCheng, WEngst, SGoon, LKlein, RRLe, DTMac, MParks, JJQian, FRodriquez, MStout, TJTill, JHWon, KAWu, XYakes, FMYu, PZhang, WZhao, YLamb, PNuss, JMXu, W The design, synthesis, and biological evaluation of potent receptor tyrosine kinase inhibitors. Bioorg Med Chem Lett22:4979-85 (2012) 
 
Fibroblast growth factor receptor 1
Name:Fibroblast growth factor receptor 1
Type:Receptor
Mol. Mass.:91861.70
Organism:Homo sapiens (Human)
Description:P11362
Residue:822
BDBM50421035
NameBDBM50421035
Synonyms:CHEMBL2087169
TypeSmall organic molecule
Emp. Form.C26H28FN5O
Mol. Mass.445.5318
SMILESCCN1CCC(CC1)Nc1ccc2NC(=O)C(=C(c3ncc(C)[nH]3)c3ccccc3F)c2c1