Reaction Details
TargetFarnesyl pyrophosphate synthase
LigandBDBM50386555
Substrate/Competitorn/a
Meas. Tech.ChEMBL_842483 (CHEMBL2092208)
IC50 28±n/a nM
Citation De Schutter, JWShaw, JLin, YSTsantrizos, YS Design of potent bisphosphonate inhibitors of the human farnesyl pyrophosphate synthase via targeted interactions with the active site 'capping' phenyls. Bioorg Med Chem20:5583-91 (2012) 
 
Farnesyl pyrophosphate synthase
Name:Farnesyl pyrophosphate synthase
Type:Enzyme
Mol. Mass.:48272.89
Organism:Homo sapiens (Human)
Description:P14324
Residue:419
BDBM50386555
NameBDBM50386555
Synonyms:CHEMBL2048241
TypeSmall organic molecule
Emp. Form.C15H20N2O7P2
Mol. Mass.402.276
SMILESCC(C)Oc1ccc(cc1)-c1ccnc(NC(P(O)(O)=O)P(O)(O)=O)c1