Reaction Details
TargetFarnesyl pyrophosphate synthase
LigandBDBM50421092
Substrate/Competitorn/a
Meas. Tech.ChEMBL_842483 (CHEMBL2092208)
IC50 1000±n/a nM
Citation De Schutter, JWShaw, JLin, YSTsantrizos, YS Design of potent bisphosphonate inhibitors of the human farnesyl pyrophosphate synthase via targeted interactions with the active site 'capping' phenyls. Bioorg Med Chem20:5583-91 (2012) 
 
Farnesyl pyrophosphate synthase
Name:Farnesyl pyrophosphate synthase
Type:Enzyme
Mol. Mass.:48272.89
Organism:Homo sapiens (Human)
Description:P14324
Residue:419
BDBM50421092
NameBDBM50421092
Synonyms:CHEMBL2088337
TypeSmall organic molecule
Emp. Form.C13H16N2O6P2
Mol. Mass.358.2235
SMILESOP(O)(=O)C(Nc1cncc(Cc2ccccc2)c1)P(O)(O)=O