Reaction Details
TargetMitogen-activated protein kinase 11
LigandBDBM50421140
Substrate/Competitorn/a
Meas. Tech.ChEMBL_839530 (CHEMBL2090337)
IC50 8.5±n/a nM
Citation Tynebor, RMChen, MHNatarajan, SRO'Neill, EAThompson, JEFitzgerald, CEO'Keefe, SJDoherty, JB Synthesis and biological activity of pyridopyridazin-6-one p38a MAP kinase inhibitors. Part 2. Bioorg Med Chem Lett22:5979-83 (2012) 
 
Mitogen-activated protein kinase 11
Name:Mitogen-activated protein kinase 11
Type:Enzyme
Mol. Mass.:41390.66
Organism:Mus musculus (mouse)
Description:Q9WUI1
Residue:364
BDBM50421140
NameBDBM50421140
Synonyms:CHEMBL2088591
TypeSmall organic molecule
Emp. Form.C24H16F2N4O4
Mol. Mass.462.405
SMILESCOc1ccc(cc1-c1c2ccc(Oc3ccc(F)cc3F)nn2ccc1=O)-c1nnc(C)o1