Reaction Details
TargetNuclear receptor subfamily 1 group I member 2
LigandBDBM50317583
Substrate/Competitorn/a
Meas. Tech.ChEMBL_839534 (CHEMBL2090341)
EC50>30000±n/a nM
Citation Tynebor, RMChen, MHNatarajan, SRO'Neill, EAThompson, JEFitzgerald, CEO'Keefe, SJDoherty, JB Synthesis and biological activity of pyridopyridazin-6-one p38a MAP kinase inhibitors. Part 2. Bioorg Med Chem Lett22:5979-83 (2012) 
 
Nuclear receptor subfamily 1 group I member 2
Name:Nuclear receptor subfamily 1 group I member 2
Type:Nuclear receptor
Mol. Mass.:49774.77
Organism:Homo sapiens (Human)
Description:O75469
Residue:434
BDBM50317583
NameBDBM50317583
Synonyms:1-(2,6-difluoro-4-(5-methyl-1,3,4-oxadiazol-2-yl)phenyl)-6-(2,4-difluorophenyl)-2H-quinolizin-2-one | CHEMBL1098546
TypeSmall organic molecule
Emp. Form.C24H13F4N3O2
Mol. Mass.451.3725
SMILESCc1nnc(o1)-c1cc(F)c(c(F)c1)-c1c2cccc(-c3ccc(F)cc3F)n2ccc1=O