Reaction Details
TargetMitogen-activated protein kinase 11
LigandBDBM50421131
Substrate/Competitorn/a
Meas. Tech.ChEMBL_839530 (CHEMBL2090337)
IC50 3000±n/a nM
Citation Tynebor, RMChen, MHNatarajan, SRO'Neill, EAThompson, JEFitzgerald, CEO'Keefe, SJDoherty, JB Synthesis and biological activity of pyridopyridazin-6-one p38a MAP kinase inhibitors. Part 2. Bioorg Med Chem Lett22:5979-83 (2012) 
 
Mitogen-activated protein kinase 11
Name:Mitogen-activated protein kinase 11
Type:Enzyme
Mol. Mass.:41390.66
Organism:Mus musculus (mouse)
Description:Q9WUI1
Residue:364
BDBM50421131
NameBDBM50421131
Synonyms:CHEMBL2088581
TypeSmall organic molecule
Emp. Form.C25H18F3N3O3
Mol. Mass.465.4239
SMILESFc1ccc(Oc2ccc3c(-c4cc(ccc4F)C(=O)N4CCCC4)c(=O)ccn3n2)c(F)c1