Reaction Details
TargetSonic hedgehog protein
LigandBDBM50421186
Substrate/Competitorn/a
Meas. Tech.ChEMBL_839706 (CHEMBL2089533)
IC50 2.9±n/a nM
Citation Ohashi, TOguro, YTanaka, TShiokawa, ZShibata, SSato, YYamakawa, HHattori, HYamamoto, YKondo, SMiyamoto, MTojo, HBaba, ASasaki, S Discovery of pyrrolo[3,2-c]quinoline-4-one derivatives as novel hedgehog signaling inhibitors. Bioorg Med Chem20:5496-506 (2012) 
 
Sonic hedgehog protein
Name:Sonic hedgehog protein
Type:Protein
Mol. Mass.:47784.50
Organism:Mus musculus (Mouse)
Description:Q62226
Residue:437
BDBM50421186
NameBDBM50421186
Synonyms:CHEMBL2086800
TypeSmall organic molecule
Emp. Form.C28H30N4O4
Mol. Mass.486.5622
SMILESCOc1c(C(=O)NCCN2CCCC2)n(C)c2c1c(=O)n(CC(=O)c1ccccc1)c1ccccc21