Reaction Details
TargetSonic hedgehog protein
LigandBDBM50401328
Substrate/Competitorn/a
Meas. Tech.ChEMBL_839706 (CHEMBL2089533)
IC50 4.6±n/a nM
Citation Ohashi, TOguro, YTanaka, TShiokawa, ZShibata, SSato, YYamakawa, HHattori, HYamamoto, YKondo, SMiyamoto, MTojo, HBaba, ASasaki, S Discovery of pyrrolo[3,2-c]quinoline-4-one derivatives as novel hedgehog signaling inhibitors. Bioorg Med Chem20:5496-506 (2012) 
 
Sonic hedgehog protein
Name:Sonic hedgehog protein
Type:Protein
Mol. Mass.:47784.50
Organism:Mus musculus (Mouse)
Description:Q62226
Residue:437
BDBM50401328
NameBDBM50401328
Synonyms:CHEMBL2087239
TypeSmall organic molecule
Emp. Form.C29H30N4O6
Mol. Mass.530.5717
SMILESCOc1c(C(=O)NC2CCN(CC2)C(=O)CO)n(C)c2c1c(=O)n(CC(=O)c1ccccc1)c1ccccc21