Reaction Details
TargetCathepsin B-like cysteine protease
LigandBDBM50412201
Substrate/Competitorn/a
Meas. Tech.ChEMBL_840092 (CHEMBL2090696)
IC50 64000±n/a nM
Citation Lavrado, JMackey, ZHansell, EMcKerrow, JHPaulo, AMoreira, R Antitrypanosomal and cysteine protease inhibitory activities of alkyldiamine cryptolepine derivatives. Bioorg Med Chem Lett22:6256-60 (2012) 
 
Cathepsin B-like cysteine protease
Name:Cathepsin B-like cysteine protease
Type:Enzyme
Mol. Mass.:37220.37
Organism:Trypanosoma brucei
Description:Enzyme was expressed in yeast Pichia pastoris.
Residue:340
BDBM50412201
NameBDBM50412201
Synonyms:CRYPTOLEPINE HYDROCHLORIDE | Cryptolepine
TypeSmall organic molecule
Emp. Form.C16H12N2
Mol. Mass.232.2799
SMILESCn1c2c(cc3ccccc13)nc1ccccc21