Reaction Details
TargetActivated CDC42 kinase 1
LigandBDBM14806
Substrate/Competitorn/a
Meas. Tech.ChEMBL_840096 (CHEMBL2090700)
Ki 1000±n/a nM
Citation Jiao, XKopecky, DJLiu, JLiu, JJaen, JCCardozo, MGSharma, RWalker, NWesche, HLi, SFarrelly, EXiao, SHWang, ZKayser, F Synthesis and optimization of substituted furo[2,3-d]-pyrimidin-4-amines and 7H-pyrrolo[2,3-d]pyrimidin-4-amines as ACK1 inhibitors. Bioorg Med Chem Lett22:6212-7 (2012) 
 
Activated CDC42 kinase 1
Name:Activated CDC42 kinase 1
Type:Protein
Mol. Mass.:114577.86
Organism:Homo sapiens (Human)
Description:Q07912
Residue:1038
BDBM14806
NameBDBM14806
Synonyms:5,6-Diphenyl-furo[2,3-d]pyrimidin-4 -ylamine DFP-4A | furanopyrimidine compound 8
TypeSmall organic molecule
Emp. Form.C18H13N3O
Mol. Mass.287.3153
SMILESNc1ncnc2oc(c(-c3ccccc3)c12)-c1ccccc1