Reaction Details
TargetActivated CDC42 kinase 1
LigandBDBM50421276
Substrate/Competitorn/a
Meas. Tech.ChEMBL_840099 (CHEMBL2090703)
Ki 2±n/a nM
Citation Jiao, XKopecky, DJLiu, JLiu, JJaen, JCCardozo, MGSharma, RWalker, NWesche, HLi, SFarrelly, EXiao, SHWang, ZKayser, F Synthesis and optimization of substituted furo[2,3-d]-pyrimidin-4-amines and 7H-pyrrolo[2,3-d]pyrimidin-4-amines as ACK1 inhibitors. Bioorg Med Chem Lett22:6212-7 (2012) 
 
Activated CDC42 kinase 1
Name:Activated CDC42 kinase 1
Type:Protein
Mol. Mass.:114577.86
Organism:Homo sapiens (Human)
Description:Q07912
Residue:1038
BDBM50421276
NameBDBM50421276
Synonyms:CHEMBL2087652
TypeSmall organic molecule
Emp. Form.C25H27N5O3S
Mol. Mass.477.579
SMILESCN(C)S(=O)(=O)c1ccc(cc1)-c1[nH]c2ncnc(NC[C@@H]3CCCO3)c2c1-c1ccccc1