Reaction Details
TargetActivated CDC42 kinase 1
LigandBDBM50421254
Substrate/Competitorn/a
Meas. Tech.ChEMBL_840099 (CHEMBL2090703)
Ki 4±n/a nM
Citation Jiao, XKopecky, DJLiu, JLiu, JJaen, JCCardozo, MGSharma, RWalker, NWesche, HLi, SFarrelly, EXiao, SHWang, ZKayser, F Synthesis and optimization of substituted furo[2,3-d]-pyrimidin-4-amines and 7H-pyrrolo[2,3-d]pyrimidin-4-amines as ACK1 inhibitors. Bioorg Med Chem Lett22:6212-7 (2012) 
 
Activated CDC42 kinase 1
Name:Activated CDC42 kinase 1
Type:Protein
Mol. Mass.:114577.86
Organism:Homo sapiens (Human)
Description:Q07912
Residue:1038
BDBM50421254
NameBDBM50421254
Synonyms:CHEMBL2087872
TypeSmall organic molecule
Emp. Form.C29H32FN5O2
Mol. Mass.501.5951
SMILESFc1ccccc1-c1c([nH]c2ncnc(NC[C@@H]3CCCO3)c12)-c1ccc(OCCN2CCCC2)cc1