Reaction Details
TargetBeta-2 adrenergic receptor
LigandBDBM50421325
Substrate/Competitorn/a
Meas. Tech.ChEMBL_841415 (CHEMBL2091584)
Ki 45±n/a nM
Citation Beattie, DBeer, DBradley, MEBruce, ICharlton, SJCuenoud, BMFairhurst, RAFarr, DFozard, JRJanus, DRosethorne, EMSandham, DASykes, DATrifilieff, ATurner, KLWissler, E An investigation into the structure-activity relationships associated with the systematic modification of theß(2)-adrenoceptor agonist indacaterol. Bioorg Med Chem Lett22:6280-5 (2012) 
 
Beta-2 adrenergic receptor
Name:Beta-2 adrenergic receptor
Type:n/a
Mol. Mass.:46461.69
Organism:Homo sapiens (Human)
Description:P07550
Residue:413
BDBM50421325
NameBDBM50421325
Synonyms:CHEMBL2088197
TypeSmall organic molecule
Emp. Form.C24H30N2O3
Mol. Mass.394.5066
SMILESCCc1cc2CC(Cc2cc1CC)NC[C@H](O)c1ccc(O)c2NC(=O)CCc12