Reaction Details
TargetBeta-2 adrenergic receptor
LigandBDBM50318159
Substrate/Competitorn/a
Meas. Tech.ChEMBL_841415 (CHEMBL2091584)
Ki 16±n/a nM
Citation Beattie, DBeer, DBradley, MEBruce, ICharlton, SJCuenoud, BMFairhurst, RAFarr, DFozard, JRJanus, DRosethorne, EMSandham, DASykes, DATrifilieff, ATurner, KLWissler, E An investigation into the structure-activity relationships associated with the systematic modification of theß(2)-adrenoceptor agonist indacaterol. Bioorg Med Chem Lett22:6280-5 (2012) 
 
Beta-2 adrenergic receptor
Name:Beta-2 adrenergic receptor
Type:n/a
Mol. Mass.:46461.69
Organism:Homo sapiens (Human)
Description:P07550
Residue:413
BDBM50318159
NameBDBM50318159
Synonyms:8-Hydroxy-5-[(R)-1-hydroxy-2-(5,6-diethylindan-2-ylamino)-ethyl]-1H-quinolin-2-one INDACATEROL
TypeSmall organic molecule
Emp. Form.C24H28N2O3
Mol. Mass.392.4907
SMILESCCc1cc2CC(Cc2cc1CC)NC[C@H](O)c1ccc(O)c2[nH]c(=O)ccc12