Reaction Details
TargetBeta-1 adrenergic receptor
LigandBDBM50421323
Substrate/Competitorn/a
Meas. Tech.ChEMBL_841416 (CHEMBL2091585)
Ki>10000±n/a nM
Citation Beattie, DBeer, DBradley, MEBruce, ICharlton, SJCuenoud, BMFairhurst, RAFarr, DFozard, JRJanus, DRosethorne, EMSandham, DASykes, DATrifilieff, ATurner, KLWissler, E An investigation into the structure-activity relationships associated with the systematic modification of theß(2)-adrenoceptor agonist indacaterol. Bioorg Med Chem Lett22:6280-5 (2012) 
 
Beta-1 adrenergic receptor
Name:Beta-1 adrenergic receptor
Type:G Protein-Coupled Receptor (GPCR)
Mol. Mass.:51338.40
Organism:Homo sapiens (Human)
Description:P08588
Residue:477
BDBM50421323
NameBDBM50421323
Synonyms:CHEMBL2088195
TypeSmall organic molecule
Emp. Form.C25H30N2O3
Mol. Mass.406.5173
SMILESCCc1cc2CC(Cc2cc1CC)NCC(O)c1c(C)cc(O)c2[nH]c(=O)ccc12