Reaction Details
TargetBeta-2 adrenergic receptor
LigandBDBM50421326
Substrate/Competitorn/a
Meas. Tech.ChEMBL_841421 (CHEMBL2091590)
IC50 240±n/a nM
Citation Beattie, DBeer, DBradley, MEBruce, ICharlton, SJCuenoud, BMFairhurst, RAFarr, DFozard, JRJanus, DRosethorne, EMSandham, DASykes, DATrifilieff, ATurner, KLWissler, E An investigation into the structure-activity relationships associated with the systematic modification of theß(2)-adrenoceptor agonist indacaterol. Bioorg Med Chem Lett22:6280-5 (2012) 
 
Beta-2 adrenergic receptor
Name:Beta-2 adrenergic receptor
Type:Enzyme Catalytic Domain
Mol. Mass.:46993.24
Organism:GUINEA PIG
Description:adrenergic Beta2 ADRB2 GUINEA PIG::Q8K4Z4
Residue:418
BDBM50421326
NameBDBM50421326
Synonyms:CHEMBL2088198
TypeSmall organic molecule
Emp. Form.C24H28N2O2
Mol. Mass.376.4913
SMILESCCc1cc2CC(Cc2cc1CC)NCCc1ccc(O)c2[nH]c(=O)ccc12