Reaction Details
TargetHistamine H1 receptor
LigandBDBM50017376
Substrate/Competitorn/a
Meas. Tech.ChEBML_84246
Kd 302±n/a nM
Citation Zhang, Mter Laak, AMTimmerman, H Optical isomers of the H1 antihistamine terfenadine: synthesis and activity Bioorg Med Chem Lett1:387-390 (1991)    Article
 
Histamine H1 receptor
Name:Histamine H1 receptor
Type:G Protein-Coupled Receptor (GPCR)
Mol. Mass.:55641.53
Organism:Cavia porcellus (domestic guinea pig)
Description:Guinea pig cerebellum was used in binding assay.
Residue:488
BDBM50017376
NameBDBM50017376
Synonyms:(+/-)1-(4-tert-butylphenyl)-4-(4-(hydroxydiphenylmethyl)piperidin-1-yl)butan-1-ol 1-(4-tert-Butyl-phenyl)-4-[4-(hydroxy-diphenyl-methyl)-piperidin-1-yl]-butan-1-ol(Terfenadine) CHEMBL17157 teraenadine
TypeSmall organic molecule
Emp. Form.C32H41NO2
Mol. Mass.471.6734
SMILESCC(C)(C)c1ccc(cc1)C(O)CCCN1CCC(CC1)C(O)(c1ccccc1)c1ccccc1