Reaction Details
Target5-hydroxytryptamine receptor 4
LigandBDBM50421359
Substrate/Competitorn/a
Meas. Tech.ChEMBL_201063 (CHEMBL805839)
Ki 0.079433±n/a nM
Citation  TBA Bioorg Med Chem Lett4:667-668 (1994)    Article
 
5-hydroxytryptamine receptor 4
Name:5-hydroxytryptamine receptor 4
Type:PROTEIN
Mol. Mass.:45024.02
Organism:Sus scrofa
Description:ChEMBL_1297282
Residue:402
BDBM50421359
NameBDBM50421359
Synonyms:CHEMBL145075
TypeSmall organic molecule
Emp. Form.C21H28N2O3
Mol. Mass.356.4586
SMILESCCCCN1CCC(COC(=O)c2c3OCCn3c3ccccc23)CC1