Reaction Details
Target5-hydroxytryptamine receptor 4
LigandBDBM50421360
Substrate/Competitorn/a
Meas. Tech.ChEBML_201061
IC50 0.025119±n/a nM
Citation  TBA Bioorg Med Chem Lett4:667-668 (1994)    Article
 
5-hydroxytryptamine receptor 4
Name:5-hydroxytryptamine receptor 4
Type:Enzyme Catalytic Domain
Mol. Mass.:43735.29
Organism:GUINEA PIG
Description:5-HT4 HTR4 GUINEA PIG::O70528
Residue:388
BDBM50421360
NameBDBM50421360
Synonyms:CHEMBL358119 | SB-207058
TypeSmall organic molecule
Emp. Form.C22H30N2O3
Mol. Mass.370.4852
SMILESCCCCN1CCC(COC(=O)c2c3OCCCn3c3ccccc23)CC1