Reaction Details
Target5-hydroxytryptamine receptor 4
LigandBDBM50421361
Substrate/Competitorn/a
Meas. Tech.ChEBML_201061
IC50 0.501187±n/a nM
Citation  TBA Bioorg Med Chem Lett4:667-668 (1994)    Article
 
5-hydroxytryptamine receptor 4
Name:5-hydroxytryptamine receptor 4
Type:Enzyme Catalytic Domain
Mol. Mass.:43735.29
Organism:GUINEA PIG
Description:5-HT4 HTR4 GUINEA PIG::O70528
Residue:388
BDBM50421361
NameBDBM50421361
Synonyms:CHEMBL143426
TypeSmall organic molecule
Emp. Form.C19H26N2O2
Mol. Mass.314.4219
SMILESCCCCN1CCC(COC(=O)c2c[nH]c3ccccc23)CC1