Reaction Details
TargetIntegrin alpha-4/beta-1
LigandBDBM50087608
Substrate/Competitorn/a
Meas. Tech.ChEMBL_214662 (CHEMBL819076)
IC50 4±n/a nM
Citation Chen, LTilley, JWGuthrie, RWMennona, FHuang, TNKaplan, GTrilles, RMiklowski, DHuby, NSchwinge, VWolitzky, BRowan, K N-benzylpyroglutamyl-L-phenylalanine derivatives as VCAM/VLA-4 antagonists. Bioorg Med Chem Lett10:729-33 (2000) Integrin alpha-4/beta-1
Name:Integrin alpha-4/beta-1
Type:n/a
Mol. Mass.:n/a
Description:ASSAY_ID of EBI is 88912
Components:This complex has 2 components.
Component 1
Name:Integrin beta-1
Synonyms:CD_antigen=CD29 Fibronectin receptor beta GPIIA ITGB1 MDF2 | MSK12
Type:Enzyme
Mol. Mass.:88400.38
Organism:Homo sapiens (Human)
Description:P05556
Residue:798
Component 2
Name:Integrin alpha-4
Synonyms:CD49 antigen-like family member D CD49d antigen ITA4_HUMAN Integrin alpha-4 Integrin alpha-IV VLA-4 integrin alpha 4 precursor | integrin alpha-4 precursor
Type:Membrane Protein
Mol. Mass.:114897.35
Organism:Homo sapiens (Human)
Description:P13612
Residue:1032
BDBM50087608
NameBDBM50087608
Synonyms:(S)-2-[(1-Benzyl-5-oxo-pyrrolidine-2-carbonyl)-amino]-3-{4-[(2-oxo-1,2-dihydro-pyridine-3-carbonyl)-amino]-phenyl}-propionic acid | CHEMBL164256
TypeSmall organic molecule
Emp. Form.C27H26N4O6
Mol. Mass.502.5185
SMILESOC(=O)[C@H](Cc1ccc(NC(=O)c2ccc[nH]c2=O)cc1)NC(=O)C1CCC(=O)N1Cc1ccccc1