Reaction Details
TargetIntegrin alpha-4/beta-1
LigandBDBM50113539
Substrate/Competitorn/a
Meas. Tech.ChEMBL_213406 (CHEMBL815429)
IC50 0.200000±n/a nM
Citation Yang, GXChang, LLTruong, QDoherty, GAMagriotis, PAde Laszlo, SELi, BMacCoss, MKidambi, UEgger, LAMcCauley, EVan Riper, GMumford, RASchmidt, JAHagmann, WK N-Tetrahydrofuroyl-(L)-phenylalanine derivatives as potent VLA-4 antagonists. Bioorg Med Chem Lett12:1497-500 (2002) Integrin alpha-4/beta-1
Name:Integrin alpha-4/beta-1
Type:n/a
Mol. Mass.:n/a
Description:ASSAY_ID of EBI is 88912
Components:This complex has 2 components.
Component 1
Name:Integrin beta-1
Synonyms:CD_antigen=CD29 Fibronectin receptor beta GPIIA ITGB1 MDF2 | MSK12
Type:Enzyme
Mol. Mass.:88400.38
Organism:Homo sapiens (Human)
Description:P05556
Residue:798
Component 2
Name:Integrin alpha-4
Synonyms:CD49 antigen-like family member D CD49d antigen ITA4_HUMAN Integrin alpha-4 Integrin alpha-IV VLA-4 integrin alpha 4 precursor | integrin alpha-4 precursor
Type:Membrane Protein
Mol. Mass.:114897.35
Organism:Homo sapiens (Human)
Description:P13612
Residue:1032
BDBM50113539
NameBDBM50113539
Synonyms:(S)-3-{4-[(3,5-Dichloro-pyridine-4-carbonyl)-amino]-phenyl}-2-[((R)-2-methyl-tetrahydro-furan-2-carbonyl)-amino]-propionic acid | CHEMBL34238
TypeSmall organic molecule
Emp. Form.C21H21Cl2N3O5
Mol. Mass.466.315
SMILESC[C@@]1(CCCO1)C(=O)N[C@@H](Cc1ccc(NC(=O)c2c(Cl)cncc2Cl)cc1)C(O)=O