Reaction Details
TargetSubstance-P receptor
LigandBDBM50421561
Substrate/Competitorn/a
Meas. Tech.ChEBML_205889
IC50 1.6±n/a nM
Citation Ryckmans, TBerton, OGrimée, RKogej, TLamberty, YPasau, PTalaga, PGenicot, C Dual NK(1) antagonists--serotonin reuptake inhibitors as potential antidepressants. Part 2: SAR and activity of benzyloxyphenethyl piperazine derivatives. Bioorg Med Chem Lett12:3195-8 (2002) Substance-P receptor
Name:Substance-P receptor
Type:G Protein-Coupled Receptor (GPCR)
Mol. Mass.:46254.43
Organism:Homo sapiens (Human)
Description:P25103
Residue:407
BDBM50421561
NameBDBM50421561
Synonyms:CHEMBL419742
TypeSmall organic molecule
Emp. Form.C21H21ClF6N2O
Mol. Mass.466.848
SMILESFC(F)(F)c1cc(COCC(N2CCNCC2)c2cccc(Cl)c2)cc(c1)C(F)(F)F