Reaction Details
TargetSubstance-P receptor
LigandBDBM50421567
Substrate/Competitorn/a
Meas. Tech.ChEBML_205889
IC50 5.0±n/a nM
Citation Ryckmans, TBerton, OGrimée, RKogej, TLamberty, YPasau, PTalaga, PGenicot, C Dual NK(1) antagonists--serotonin reuptake inhibitors as potential antidepressants. Part 2: SAR and activity of benzyloxyphenethyl piperazine derivatives. Bioorg Med Chem Lett12:3195-8 (2002) Substance-P receptor
Name:Substance-P receptor
Type:G Protein-Coupled Receptor (GPCR)
Mol. Mass.:46254.43
Organism:Homo sapiens (Human)
Description:P25103
Residue:407
BDBM50421567
NameBDBM50421567
Synonyms:CHEMBL109937
TypeSmall organic molecule
Emp. Form.C21H22F6N2O
Mol. Mass.432.4026
SMILESFC(F)(F)c1cc(COCC(N2CCNCC2)c2ccccc2)cc(c1)C(F)(F)F