Reaction Details
TargetIntegrin alpha-4/beta-1
LigandBDBM50128320
Substrate/Competitorn/a
Meas. Tech.ChEMBL_213389 (CHEMBL818047)
IC50 0.080000±n/a nM
Citation Doherty, GAYang, GXBorges, ETong, SMcCauley, EDTreonz, KMVan Riper, GPacholok, SSi, QKoo, GCShah, KMumford, RAHagmann, WK N-isonicotinoyl-(L)-4-aminophenylalanine derivatives as tight binding VLA-4 antagonists. Bioorg Med Chem Lett13:1891-5 (2003) Integrin alpha-4/beta-1
Name:Integrin alpha-4/beta-1
Type:n/a
Mol. Mass.:n/a
Description:ASSAY_ID of EBI is 88912
Components:This complex has 2 components.
Component 1
Name:Integrin beta-1
Synonyms:CD_antigen=CD29 Fibronectin receptor beta GPIIA ITGB1 MDF2 | MSK12
Type:Enzyme
Mol. Mass.:88400.38
Organism:Homo sapiens (Human)
Description:P05556
Residue:798
Component 2
Name:Integrin alpha-4
Synonyms:CD49 antigen-like family member D CD49d antigen ITA4_HUMAN Integrin alpha-4 Integrin alpha-IV VLA-4 integrin alpha 4 precursor | integrin alpha-4 precursor
Type:Membrane Protein
Mol. Mass.:114897.35
Organism:Homo sapiens (Human)
Description:P13612
Residue:1032
BDBM50128320
NameBDBM50128320
Synonyms:(S)-3-{4-[(2-Chloro-4-methoxy-pyridine-3-carbonyl)-amino]-phenyl}-2-{[(S)-1-(3,5-dichloro-benzenesulfonyl)-2-methyl-pyrrolidine-2-carbonyl]-amino}-propionic acid | CHEMBL293807
TypeSmall organic molecule
Emp. Form.C28H27Cl3N4O7S
Mol. Mass.669.961
SMILESCOc1ccnc(Cl)c1C(=O)Nc1ccc(C[C@H](NC(=O)[C@]2(C)CCCN2S(=O)(=O)c2cc(Cl)cc(Cl)c2)C(O)=O)cc1