Reaction Details
TargetIntegrin alpha-4/beta-1
LigandBDBM50134700
Substrate/Competitorn/a
Meas. Tech.ChEMBL_213399 (CHEMBL818057)
IC50 0.100000±n/a nM
Citation Stasiak, MMehlin, CBoni, EVaisar, TLittle, TKim, HOQabar, M Sulphonamide-based small molecule VLA-4 antagonists. Bioorg Med Chem Lett13:3875-8 (2003) Integrin alpha-4/beta-1
Name:Integrin alpha-4/beta-1
Type:n/a
Mol. Mass.:n/a
Description:ASSAY_ID of EBI is 88912
Components:This complex has 2 components.
Component 1
Name:Integrin beta-1
Synonyms:CD_antigen=CD29 Fibronectin receptor beta GPIIA ITGB1 MDF2 | MSK12
Type:Enzyme
Mol. Mass.:88400.38
Organism:Homo sapiens (Human)
Description:P05556
Residue:798
Component 2
Name:Integrin alpha-4
Synonyms:CD49 antigen-like family member D CD49d antigen ITA4_HUMAN Integrin alpha-4 Integrin alpha-IV VLA-4 integrin alpha 4 precursor | integrin alpha-4 precursor
Type:Membrane Protein
Mol. Mass.:114897.35
Organism:Homo sapiens (Human)
Description:P13612
Residue:1032
BDBM50134700
NameBDBM50134700
Synonyms:(S)-4-(Benzenesulfonyl-methyl-amino)-4-{(S)-1-carboxy-2-[4-(2,6-dichloro-benzyloxy)-phenyl]-ethylcarbamoyl}-butyric acid | CHEMBL338417
TypeSmall organic molecule
Emp. Form.C28H28Cl2N2O8S
Mol. Mass.623.502
SMILESCN([C@@H](CCC(O)=O)C(=O)N[C@@H](Cc1ccc(OCc2c(Cl)cccc2Cl)cc1)C(O)=O)S(=O)(=O)c1ccccc1