Reaction Details
TargetIntegrin alpha-4/beta-1
LigandBDBM50421639
Substrate/Competitorn/a
Meas. Tech.ChEMBL_213380 (CHEMBL818163)
IC50 0.050000±n/a nM
Citation Porter, JRArchibald, SCBrown, JAChilds, KCritchley, DHead, JCParton, TARobinson, MKShock, ATaylor, RJWarrellow, GJ Dehydrophenylalanine derivatives as VLA-4 integrin antagonists. Bioorg Med Chem Lett13:805-8 (2003) Integrin alpha-4/beta-1
Name:Integrin alpha-4/beta-1
Type:n/a
Mol. Mass.:n/a
Description:ASSAY_ID of EBI is 88912
Components:This complex has 2 components.
Component 1
Name:Integrin beta-1
Synonyms:CD_antigen=CD29 Fibronectin receptor beta GPIIA ITGB1 MDF2 | MSK12
Type:Enzyme
Mol. Mass.:88400.38
Organism:Homo sapiens (Human)
Description:P05556
Residue:798
Component 2
Name:Integrin alpha-4
Synonyms:CD49 antigen-like family member D CD49d antigen ITA4_HUMAN Integrin alpha-4 Integrin alpha-IV VLA-4 integrin alpha 4 precursor | integrin alpha-4 precursor
Type:Membrane Protein
Mol. Mass.:114897.35
Organism:Homo sapiens (Human)
Description:P13612
Residue:1032
BDBM50421639
NameBDBM50421639
Synonyms:CHEMBL2110195
TypeSmall organic molecule
Emp. Form.C21H20Cl2N2O4
Mol. Mass.435.3
SMILESCC(C)(C)C(=O)N\C(=C/c1ccc(NC(=O)c2c(Cl)cccc2Cl)cc1)C(O)=O